{"text_format":"1","workbook":"xlsx","n_sheets":9,"sheets":["注意事項","様式1 名簿","様式2 計算書","様式3 K","様式4 C","様式5 WK","様式6 WC","様式7 S・P","様式8 借艇・プログラム"],"not_rendered":{"charts":0,"images":1,"macros":1,"external_links":0,"defined_names":3,"comments":0,"pivot_tables":0},"unopened":[],"bounds":{"document_bytes":16777216,"sheet_cells":100000,"rows_first":2000,"rows_last":500,"rows_between":2000,"halvings":0,"cell_chars":16384,"cell_head_chars":4096},"cells_cut":0,"cells_raw":0,"read":"whole","date_system":"1900"}

{"sheet":"注意事項","index":0,"n_rows":28,"n_cols":4,"rows_kept":28,"cut":false,"hidden":false,"merged":[[1,0,1,1],[0,0,0,1]]}
["平成２９年度　関東高等学校カヌー大会",null,null,"←大会の正式名を入力してください（年度の数字は全角で）。"]
["申し込みに関しての注意事項"]
[]
["①","様式１～様式８に必要事項を入力・印刷し，提出してください。\n様式は全国高体連カヌー専門部ＨＰからもダウンロードできます。"]
[]
["②","水色のセルは，入力必須項目です。入力するとセルが白くなります。\n数字とハイフンは半角で入力してください。\n参加生徒名簿の「氏」や「名」のセルにはスペースを入力しないでください。\n「よみがな」の氏と名の間には，全角スペースを入れてください。【様式１】"]
[]
["③","どのシートも削除しないでください。マクロが働かなくなります。"]
[]
["④","高体連に加盟していない県については校長印と協会長印を押して提出してください。【様式１】"]
[]
["⑤","高体連に加盟している県については各県の代表者に提出し，代表者が高体連会長印をもらってください。【様式１】"]
[]
["⑥","各種目タイムの早い順に，様式１のNo.を入力してください。【様式３～６】"]
[]
["⑦","各学校にてデータを入力した後，出力書類を代表者に提出するとともに，\nこのエクセルファイルを以下のアドレスに送信してください。\nその際ファイル名の最初に学校名を入れてください。\n（データ送信はプログラム作成のためのものであり，正式な申し込みは③または④を経由し郵送にて受け付けた書類となります。）"]
[null,"aida.kouji.a1@spec.ed.jp",null,"←データ送信先メールアドレスを入力してください。"]
[]
["⑧","振込の際に，振込人には必ず学校名を記入してください。\nまた，振込依頼書のコピーを参加料計算書に貼付してください。【様式２】\n様式２の艇数のセルは，様式３～７の艇数と異なると，黄色になります。"]
[]
{"$rows_left_out":9}
{"sheet":"様式1 名簿","index":1,"n_rows":61,"n_cols":18,"rows_kept":61,"cut":false,"hidden":false,"merged":[[20,3,20,4],[21,3,21,4],[22,3,22,4],[4,13,5,14],[6,13,11,14],[20,10,20,11],[18,6,19,6],[18,7,18,9],[21,10,21,11],[22,10,22,11],[23,3,23,4],[24,3,24,4],[25,3,25,4],[26,3,26,4],[27,3,27,4],[28,3,28,4],[29,3,29,4],[30,3,30,4],[31,3,31,4],[32,3,32,4],[33,3,33,4],[34,3,34,4],[44,3,44,4],[35,3,35,4],[36,3,36,4],[37,3,37,4],[38,3,38,4],[39,3,39,4],[45,3,45,4],[46,3,46,4],[49,3,49,4],[18,3,19,4],[6,1,6,4],[8,1,8,4],[9,1,9,4],[10,1,10,4],[11,1,11,4],[14,1,14,3],[13,1,13,4],[15,1,15,4],[40,3,40,4],[41,3,41,4],[42,3,42,4],[43,3,43,4],[3,0,3,11],[7,1,7,3],[11,7,11,11],[18,10,18,11],[19,10,19,11],[5,0,5,4],[12,0,12,4],[6,10,6,11],[7,10,7,11],[8,10,8,11],[12,8,12,11],[13,8,13,11],[5,7,5,11],[18,0,19,0],[18,1,19,1],[18,2,19,2],[23,10,23,11],[24,10,24,11],[25,10,25,11],[26,10,26,11],[27,10,27,11],[28,10,28,11],[29,10,29,11],[30,10,30,11],[31,10,31,11],[32,10,32,11],[33,10,33,11],[34,10,34,11],[35,10,35,11],[45,10,45,11],[36,10,36,11],[37,10,37,11],[38,10,38,11],[39,10,39,11],[40,10,40,11],[46,10,46,11],[49,10,49,11],[9,10,9,11],[10,7,10,11],[60,1,60,3],[60,8,60,10],[17,0,17,11],[47,3,47,4],[47,10,47,11],[48,3,48,4],[48,10,48,11],[18,5,19,5],[41,10,41,11],[42,10,42,11],[43,10,43,11],[44,10,44,11]]}
["（様式１号）"]
[null,null,null,null,null,null,null,null,null,null,null,"平成　　　　年　　　　月　　　　日"]
[]
[{"$f":"注意事項!A1 &\"　参加申込書\"","v":"平成２９年度　関東高等学校カヌー大会　参加申込書"}]
[null,null,null,null,null,null,null,null,null,null,null,null,null,"↑"]
["高等学校",null,null,null,null,null,null,"引率者"]
["都県",null,null,null,null,null,null,"1　職名",null,"氏　名",null,null,null,"押さないで\nください\n\nプログラム作成用",null,null,"茨城県","男"]
["学校名",null,null,null,"高等学校",null,null,"2　職名",null,"氏　名",null,null,null,null,null,null,"栃木県","女"]
["郵便番号",null,null,null,null,null,null,"3　職名",null,"氏　名",null,null,null,null,null,null,"群馬県"]
["住所",null,null,null,null,null,null,"4　職名",null,"氏　名",null,null,null,null,null,null,"埼玉県"]
["電話番号",null,null,null,null,null,null,"※引率者が複数の場合は全員記入し，代表を「1」の欄に記入。",null,null,null,null,null,null,null,null,"千葉県"]
["FAX番号",null,null,null,null,null,null,"宿舎",null,null,null,null,null,null,null,null,"東京都"]
["記載責任者",null,null,null,null,null,null,"宿舎名",null,null,null,null,null,null,null,null,"神奈川県"]
["職名",null,null,null,null,null,null,"電話番号",null,null,null,null,null,null,null,null,"山梨県"]
["氏　名",null,null,null,"印"]
["Ｅメール"]
[]
["参加生徒名簿"]
["№","氏","名","よみがな",null,"性別","学年","生年月日",null,null,"日本カヌー連盟"]
[null,null,null,null,null,"性別",null,"西暦","月","日","登録番号"]
{"$rows_left_out":42}
{"sheet":"様式2 計算書","index":2,"n_rows":19,"n_cols":21,"rows_kept":19,"cut":false,"hidden":false,"merged":[[8,1,8,2],[10,1,10,2],[10,3,10,4],[8,5,8,6],[12,9,12,12],[12,1,12,2],[12,3,12,4],[12,5,13,8],[14,9,14,12],[18,0,18,12],[14,0,15,0],[14,1,14,2],[14,3,14,4],[14,5,15,8],[4,4,4,6],[4,7,4,12],[6,9,6,12],[2,0,2,12],[12,0,13,0],[6,1,6,2],[6,3,6,4],[6,5,6,6],[6,7,6,8],[6,0,11,0],[8,3,8,4],[10,5,10,6],[8,7,8,8],[10,7,10,8],[8,9,8,12],[10,9,10,12]]}
["（様式２号）"]
[]
[{"$f":"注意事項!A1&\"　参加料計算書\"","v":"平成２９年度　関東高等学校カヌー大会　参加料計算書"}]
[]
[null,null,null,null,"学校名",null,null,{"$f":"'様式1 名簿'!B8&\"高等学校\"","v":"高等学校"}]
[]
["カヌー\nスプリント","Ｋ－１",null,"Ｃ－１",null,"ＷＫ－１",null,"ＷＣ－１",null,"小　計"]
[null,null," 人",null,"人",null,"人",null,"人",{"$f":"B8+D8+F8+H8","v":0},"人×2,000円 ＝",{"$f":"J8*2000","v":0},"円",null,{"$f":"COUNT('様式3 K'!$B$13:$B$21)","v":0},null,{"$f":"COUNT('様式4 C'!$B$13:$B$21)","v":0},null,{"$f":"COUNT('様式5 WK'!$B$13:$B$21)","v":0},null,{"$f":"COUNT('様式6 WC'!$B$13:$B$21)","v":0}]
[null,"Ｋ－２",null,"Ｃ－２",null,"ＷＫ－２",null,"ＷＣ－２",null,"小　計"]
[null,null," 組",null,"組",null,"組",null,"組",{"$f":"B10+D10+F10+H10","v":0},"組×4,000円 ＝",{"$f":"J10*4000","v":0},"円",null,{"$f":"COUNT('様式3 K'!$B$25:$B$28)","v":0},null,{"$f":"COUNT('様式4 C'!$B$25:$B$28)","v":0},null,{"$f":"COUNT('様式5 WK'!$B$25:$B$28)","v":0},null,{"$f":"COUNT('様式6 WC'!$B$25:$B$28)","v":0}]
[null,"Ｋ－４",null,"Ｃ－４",null,"ＷＫ－４",null,"ＷＣ－４",null,"小　計"]
[null,null," 組",null,"組",null,"組",null,"組",{"$f":"B12+D12+F12+H12","v":0},"組×8,000円 ＝",{"$f":"J12*8000","v":0},"円",null,{"$f":"COUNT('様式3 K'!$B$32:$B$35)","v":0},null,{"$f":"COUNT('様式4 C'!$B$32:$B$35)","v":0},null,{"$f":"COUNT('様式5 WK'!$B$32:$B$35)","v":0},null,{"$f":"COUNT('様式6 WC'!$B$32:$B$35)","v":0}]
["カヌー\nスラローム","男子",null,"女子",null,null,null,null,null,"小　計"]
[null,null,"人",null,"人",null,null,null,null,{"$f":"B14+D14","v":0},"人×1,000円 ＝",{"$f":"J14*1000","v":0},"円",null,{"$f":"COUNT('様式7 S・P'!$D$13:$D$24)","v":0},null,{"$f":"COUNT('様式7 S・P'!$H$13:$H$24)","v":0}]
["カヌーポロ","男子",null,"女子",null,null,null,null,null,"小　計"]
[null,null,"組",null,"組",null,null,null,null,{"$f":"B16+D16","v":0},"組×8,000円 ＝",{"$f":"J16*8000","v":0},"円",null,{"$f":"COUNT('様式7 S・P'!$D$13)","v":0},null,{"$f":"COUNT('様式7 S・P'!$H$13)","v":0}]
[null,null,null,null,null,null,null,null,null,null,"合　計",{"$f":"L8+L10+L12+L14+L16","v":0},"円"]
[]
["\n参加料振込済依頼書のコピーを必ず貼付して下さい。"]

{"sheet":"様式3 K","index":3,"n_rows":49,"n_cols":9,"rows_kept":49,"cut":false,"hidden":false,"merged":[[37,1,37,4],[44,1,44,4],[6,0,6,1],[2,0,2,8],[6,2,6,6],[4,2,4,6],[4,0,4,1],[11,1,11,4],[23,1,23,4],[23,5,23,6],[30,5,30,8],[30,1,30,4]]}
["（様式３号）"]
[]
[{"$f":"注意事項!A1&\"　参加申込書\"","v":"平成２９年度　関東高等学校カヌー大会　参加申込書"}]
[]
["種目",null,"カヌースプリント　男子カヤック"]
[]
["学校名",null,{"$f":"'様式1 名簿'!$B$8&\"高等学校\"","v":"高等学校"}]
[]
["※黄色いセルに，様式１号のNo.を入力してください。"]
[]
["Ｋ－１"]
[null,"No.",null,null,null,"氏　名"]
["①",null,{"$f":"IF(ISTEXT(VLOOKUP($B13,'様式1 名簿'!$A:$C,2,FALSE)),VLOOKUP($B13,'様式1 名簿'!$A:$C,2,FALSE)&\"　\"&VLOOKUP($B13,'様式1 名簿'!$A:$C,3,FALSE),\"\")","v":""},null,null,{"$f":"IF(ISTEXT(VLOOKUP($B13,'様式1 名簿'!$A:$C,2,FALSE)),VLOOKUP($B13,'様式1 名簿'!$A:$C,2,FALSE)&\"　\"&VLOOKUP($B13,'様式1 名簿'!$A:$C,3,FALSE),\"\")","v":""}]
["②",null,{"$f":"IF(ISTEXT(VLOOKUP($B14,'様式1 名簿'!$A:$C,2,FALSE)),VLOOKUP($B14,'様式1 名簿'!$A:$C,2,FALSE)&\"　\"&VLOOKUP($B14,'様式1 名簿'!$A:$C,3,FALSE),\"\")","v":""},null,null,{"$f":"IF(ISTEXT(VLOOKUP($B14,'様式1 名簿'!$A:$C,2,FALSE)),VLOOKUP($B14,'様式1 名簿'!$A:$C,2,FALSE)&\"　\"&VLOOKUP($B14,'様式1 名簿'!$A:$C,3,FALSE),\"\")","v":""}]
["③",null,{"$f":"IF(ISTEXT(VLOOKUP($B15,'様式1 名簿'!$A:$C,2,FALSE)),VLOOKUP($B15,'様式1 名簿'!$A:$C,2,FALSE)&\"　\"&VLOOKUP($B15,'様式1 名簿'!$A:$C,3,FALSE),\"\")","v":""},null,null,{"$f":"IF(ISTEXT(VLOOKUP($B15,'様式1 名簿'!$A:$C,2,FALSE)),VLOOKUP($B15,'様式1 名簿'!$A:$C,2,FALSE)&\"　\"&VLOOKUP($B15,'様式1 名簿'!$A:$C,3,FALSE),\"\")","v":""}]
["④",null,{"$f":"IF(ISTEXT(VLOOKUP($B16,'様式1 名簿'!$A:$C,2,FALSE)),VLOOKUP($B16,'様式1 名簿'!$A:$C,2,FALSE)&\"　\"&VLOOKUP($B16,'様式1 名簿'!$A:$C,3,FALSE),\"\")","v":""},null,null,{"$f":"IF(ISTEXT(VLOOKUP($B16,'様式1 名簿'!$A:$C,2,FALSE)),VLOOKUP($B16,'様式1 名簿'!$A:$C,2,FALSE)&\"　\"&VLOOKUP($B16,'様式1 名簿'!$A:$C,3,FALSE),\"\")","v":""}]
["⑤",null,{"$f":"IF(ISTEXT(VLOOKUP($B17,'様式1 名簿'!$A:$C,2,FALSE)),VLOOKUP($B17,'様式1 名簿'!$A:$C,2,FALSE)&\"　\"&VLOOKUP($B17,'様式1 名簿'!$A:$C,3,FALSE),\"\")","v":""},null,null,{"$f":"IF(ISTEXT(VLOOKUP($B17,'様式1 名簿'!$A:$C,2,FALSE)),VLOOKUP($B17,'様式1 名簿'!$A:$C,2,FALSE)&\"　\"&VLOOKUP($B17,'様式1 名簿'!$A:$C,3,FALSE),\"\")","v":""}]
["⑥",null,{"$f":"IF(ISTEXT(VLOOKUP($B18,'様式1 名簿'!$A:$C,2,FALSE)),VLOOKUP($B18,'様式1 名簿'!$A:$C,2,FALSE)&\"　\"&VLOOKUP($B18,'様式1 名簿'!$A:$C,3,FALSE),\"\")","v":""},null,null,{"$f":"IF(ISTEXT(VLOOKUP($B18,'様式1 名簿'!$A:$C,2,FALSE)),VLOOKUP($B18,'様式1 名簿'!$A:$C,2,FALSE)&\"　\"&VLOOKUP($B18,'様式1 名簿'!$A:$C,3,FALSE),\"\")","v":""}]
["⑦",null,{"$f":"IF(ISTEXT(VLOOKUP($B19,'様式1 名簿'!$A:$C,2,FALSE)),VLOOKUP($B19,'様式1 名簿'!$A:$C,2,FALSE)&\"　\"&VLOOKUP($B19,'様式1 名簿'!$A:$C,3,FALSE),\"\")","v":""},null,null,{"$f":"IF(ISTEXT(VLOOKUP($B19,'様式1 名簿'!$A:$C,2,FALSE)),VLOOKUP($B19,'様式1 名簿'!$A:$C,2,FALSE)&\"　\"&VLOOKUP($B19,'様式1 名簿'!$A:$C,3,FALSE),\"\")","v":""}]
["⑧",null,{"$f":"IF(ISTEXT(VLOOKUP($B20,'様式1 名簿'!$A:$C,2,FALSE)),VLOOKUP($B20,'様式1 名簿'!$A:$C,2,FALSE)&\"　\"&VLOOKUP($B20,'様式1 名簿'!$A:$C,3,FALSE),\"\")","v":""},null,null,{"$f":"IF(ISTEXT(VLOOKUP($B20,'様式1 名簿'!$A:$C,2,FALSE)),VLOOKUP($B20,'様式1 名簿'!$A:$C,2,FALSE)&\"　\"&VLOOKUP($B20,'様式1 名簿'!$A:$C,3,FALSE),\"\")","v":""}]
{"$rows_left_out":30}
{"sheet":"様式4 C","index":4,"n_rows":49,"n_cols":9,"rows_kept":49,"cut":false,"hidden":false,"merged":[[37,1,37,4],[44,1,44,4],[23,1,23,4],[23,5,23,6],[30,1,30,4],[30,5,30,8],[11,1,11,4],[2,0,2,8],[4,0,4,1],[4,2,4,6],[6,0,6,1],[6,2,6,6]]}
["（様式４号）"]
[]
[{"$f":"注意事項!A1&\"　参加申込書\"","v":"平成２９年度　関東高等学校カヌー大会　参加申込書"}]
[]
["種目",null,"カヌースプリント　男子カナディアン"]
[]
["学校名",null,{"$f":"'様式1 名簿'!$B$8&\"高等学校\"","v":"高等学校"}]
[]
["※黄色いセルに，様式１号のNo.を入力してください。"]
[]
["Ｃ－１"]
[null,"No.",null,null,null,"氏　名"]
["①",null,{"$f":"IF(ISTEXT(VLOOKUP($B13,'様式1 名簿'!$A:$C,2,FALSE)),VLOOKUP($B13,'様式1 名簿'!$A:$C,2,FALSE)&\"　\"&VLOOKUP($B13,'様式1 名簿'!$A:$C,3,FALSE),\"\")","v":""},null,null,{"$f":"IF(ISTEXT(VLOOKUP($B13,'様式1 名簿'!$A:$C,2,FALSE)),VLOOKUP($B13,'様式1 名簿'!$A:$C,2,FALSE)&\"　\"&VLOOKUP($B13,'様式1 名簿'!$A:$C,3,FALSE),\"\")","v":""}]
["②",null,{"$f":"IF(ISTEXT(VLOOKUP($B14,'様式1 名簿'!$A:$C,2,FALSE)),VLOOKUP($B14,'様式1 名簿'!$A:$C,2,FALSE)&\"　\"&VLOOKUP($B14,'様式1 名簿'!$A:$C,3,FALSE),\"\")","v":""},null,null,{"$f":"IF(ISTEXT(VLOOKUP($B14,'様式1 名簿'!$A:$C,2,FALSE)),VLOOKUP($B14,'様式1 名簿'!$A:$C,2,FALSE)&\"　\"&VLOOKUP($B14,'様式1 名簿'!$A:$C,3,FALSE),\"\")","v":""}]
["③",null,{"$f":"IF(ISTEXT(VLOOKUP($B15,'様式1 名簿'!$A:$C,2,FALSE)),VLOOKUP($B15,'様式1 名簿'!$A:$C,2,FALSE)&\"　\"&VLOOKUP($B15,'様式1 名簿'!$A:$C,3,FALSE),\"\")","v":""},null,null,{"$f":"IF(ISTEXT(VLOOKUP($B15,'様式1 名簿'!$A:$C,2,FALSE)),VLOOKUP($B15,'様式1 名簿'!$A:$C,2,FALSE)&\"　\"&VLOOKUP($B15,'様式1 名簿'!$A:$C,3,FALSE),\"\")","v":""}]
["④",null,{"$f":"IF(ISTEXT(VLOOKUP($B16,'様式1 名簿'!$A:$C,2,FALSE)),VLOOKUP($B16,'様式1 名簿'!$A:$C,2,FALSE)&\"　\"&VLOOKUP($B16,'様式1 名簿'!$A:$C,3,FALSE),\"\")","v":""},null,null,{"$f":"IF(ISTEXT(VLOOKUP($B16,'様式1 名簿'!$A:$C,2,FALSE)),VLOOKUP($B16,'様式1 名簿'!$A:$C,2,FALSE)&\"　\"&VLOOKUP($B16,'様式1 名簿'!$A:$C,3,FALSE),\"\")","v":""}]
["⑤",null,{"$f":"IF(ISTEXT(VLOOKUP($B17,'様式1 名簿'!$A:$C,2,FALSE)),VLOOKUP($B17,'様式1 名簿'!$A:$C,2,FALSE)&\"　\"&VLOOKUP($B17,'様式1 名簿'!$A:$C,3,FALSE),\"\")","v":""},null,null,{"$f":"IF(ISTEXT(VLOOKUP($B17,'様式1 名簿'!$A:$C,2,FALSE)),VLOOKUP($B17,'様式1 名簿'!$A:$C,2,FALSE)&\"　\"&VLOOKUP($B17,'様式1 名簿'!$A:$C,3,FALSE),\"\")","v":""}]
["⑥",null,{"$f":"IF(ISTEXT(VLOOKUP($B18,'様式1 名簿'!$A:$C,2,FALSE)),VLOOKUP($B18,'様式1 名簿'!$A:$C,2,FALSE)&\"　\"&VLOOKUP($B18,'様式1 名簿'!$A:$C,3,FALSE),\"\")","v":""},null,null,{"$f":"IF(ISTEXT(VLOOKUP($B18,'様式1 名簿'!$A:$C,2,FALSE)),VLOOKUP($B18,'様式1 名簿'!$A:$C,2,FALSE)&\"　\"&VLOOKUP($B18,'様式1 名簿'!$A:$C,3,FALSE),\"\")","v":""}]
["⑦",null,{"$f":"IF(ISTEXT(VLOOKUP($B19,'様式1 名簿'!$A:$C,2,FALSE)),VLOOKUP($B19,'様式1 名簿'!$A:$C,2,FALSE)&\"　\"&VLOOKUP($B19,'様式1 名簿'!$A:$C,3,FALSE),\"\")","v":""},null,null,{"$f":"IF(ISTEXT(VLOOKUP($B19,'様式1 名簿'!$A:$C,2,FALSE)),VLOOKUP($B19,'様式1 名簿'!$A:$C,2,FALSE)&\"　\"&VLOOKUP($B19,'様式1 名簿'!$A:$C,3,FALSE),\"\")","v":""}]
["⑧",null,{"$f":"IF(ISTEXT(VLOOKUP($B20,'様式1 名簿'!$A:$C,2,FALSE)),VLOOKUP($B20,'様式1 名簿'!$A:$C,2,FALSE)&\"　\"&VLOOKUP($B20,'様式1 名簿'!$A:$C,3,FALSE),\"\")","v":""},null,null,{"$f":"IF(ISTEXT(VLOOKUP($B20,'様式1 名簿'!$A:$C,2,FALSE)),VLOOKUP($B20,'様式1 名簿'!$A:$C,2,FALSE)&\"　\"&VLOOKUP($B20,'様式1 名簿'!$A:$C,3,FALSE),\"\")","v":""}]
{"$rows_left_out":30}
{"sheet":"様式5 WK","index":5,"n_rows":49,"n_cols":9,"rows_kept":49,"cut":false,"hidden":false,"merged":[[37,1,37,4],[44,1,44,4],[23,1,23,4],[23,5,23,6],[30,1,30,4],[30,5,30,8],[11,1,11,4],[2,0,2,8],[4,0,4,1],[4,2,4,6],[6,0,6,1],[6,2,6,6]]}
["（様式５号）"]
[]
[{"$f":"注意事項!A1&\"　参加申込書\"","v":"平成２９年度　関東高等学校カヌー大会　参加申込書"}]
[]
["種目",null,"カヌースプリント　女子カヤック"]
[]
["学校名",null,{"$f":"'様式1 名簿'!$B$8&\"高等学校\"","v":"高等学校"}]
[]
["※黄色いセルに，様式１号のNo.を入力してください。"]
[]
["ＷＫ－１"]
[null,"No.",null,null,null,"氏　名"]
["①",null,{"$f":"IF(ISTEXT(VLOOKUP($B13,'様式1 名簿'!$A:$C,2,FALSE)),VLOOKUP($B13,'様式1 名簿'!$A:$C,2,FALSE)&\"　\"&VLOOKUP($B13,'様式1 名簿'!$A:$C,3,FALSE),\"\")","v":""},null,null,{"$f":"IF(ISTEXT(VLOOKUP($B13,'様式1 名簿'!$A:$C,2,FALSE)),VLOOKUP($B13,'様式1 名簿'!$A:$C,2,FALSE)&\"　\"&VLOOKUP($B13,'様式1 名簿'!$A:$C,3,FALSE),\"\")","v":""}]
["②",null,{"$f":"IF(ISTEXT(VLOOKUP($B14,'様式1 名簿'!$A:$C,2,FALSE)),VLOOKUP($B14,'様式1 名簿'!$A:$C,2,FALSE)&\"　\"&VLOOKUP($B14,'様式1 名簿'!$A:$C,3,FALSE),\"\")","v":""},null,null,{"$f":"IF(ISTEXT(VLOOKUP($B14,'様式1 名簿'!$A:$C,2,FALSE)),VLOOKUP($B14,'様式1 名簿'!$A:$C,2,FALSE)&\"　\"&VLOOKUP($B14,'様式1 名簿'!$A:$C,3,FALSE),\"\")","v":""}]
["③",null,{"$f":"IF(ISTEXT(VLOOKUP($B15,'様式1 名簿'!$A:$C,2,FALSE)),VLOOKUP($B15,'様式1 名簿'!$A:$C,2,FALSE)&\"　\"&VLOOKUP($B15,'様式1 名簿'!$A:$C,3,FALSE),\"\")","v":""},null,null,{"$f":"IF(ISTEXT(VLOOKUP($B15,'様式1 名簿'!$A:$C,2,FALSE)),VLOOKUP($B15,'様式1 名簿'!$A:$C,2,FALSE)&\"　\"&VLOOKUP($B15,'様式1 名簿'!$A:$C,3,FALSE),\"\")","v":""}]
["④",null,{"$f":"IF(ISTEXT(VLOOKUP($B16,'様式1 名簿'!$A:$C,2,FALSE)),VLOOKUP($B16,'様式1 名簿'!$A:$C,2,FALSE)&\"　\"&VLOOKUP($B16,'様式1 名簿'!$A:$C,3,FALSE),\"\")","v":""},null,null,{"$f":"IF(ISTEXT(VLOOKUP($B16,'様式1 名簿'!$A:$C,2,FALSE)),VLOOKUP($B16,'様式1 名簿'!$A:$C,2,FALSE)&\"　\"&VLOOKUP($B16,'様式1 名簿'!$A:$C,3,FALSE),\"\")","v":""}]
["⑤",null,{"$f":"IF(ISTEXT(VLOOKUP($B17,'様式1 名簿'!$A:$C,2,FALSE)),VLOOKUP($B17,'様式1 名簿'!$A:$C,2,FALSE)&\"　\"&VLOOKUP($B17,'様式1 名簿'!$A:$C,3,FALSE),\"\")","v":""},null,null,{"$f":"IF(ISTEXT(VLOOKUP($B17,'様式1 名簿'!$A:$C,2,FALSE)),VLOOKUP($B17,'様式1 名簿'!$A:$C,2,FALSE)&\"　\"&VLOOKUP($B17,'様式1 名簿'!$A:$C,3,FALSE),\"\")","v":""}]
["⑥",null,{"$f":"IF(ISTEXT(VLOOKUP($B18,'様式1 名簿'!$A:$C,2,FALSE)),VLOOKUP($B18,'様式1 名簿'!$A:$C,2,FALSE)&\"　\"&VLOOKUP($B18,'様式1 名簿'!$A:$C,3,FALSE),\"\")","v":""},null,null,{"$f":"IF(ISTEXT(VLOOKUP($B18,'様式1 名簿'!$A:$C,2,FALSE)),VLOOKUP($B18,'様式1 名簿'!$A:$C,2,FALSE)&\"　\"&VLOOKUP($B18,'様式1 名簿'!$A:$C,3,FALSE),\"\")","v":""}]
["⑦",null,{"$f":"IF(ISTEXT(VLOOKUP($B19,'様式1 名簿'!$A:$C,2,FALSE)),VLOOKUP($B19,'様式1 名簿'!$A:$C,2,FALSE)&\"　\"&VLOOKUP($B19,'様式1 名簿'!$A:$C,3,FALSE),\"\")","v":""},null,null,{"$f":"IF(ISTEXT(VLOOKUP($B19,'様式1 名簿'!$A:$C,2,FALSE)),VLOOKUP($B19,'様式1 名簿'!$A:$C,2,FALSE)&\"　\"&VLOOKUP($B19,'様式1 名簿'!$A:$C,3,FALSE),\"\")","v":""}]
["⑧",null,{"$f":"IF(ISTEXT(VLOOKUP($B20,'様式1 名簿'!$A:$C,2,FALSE)),VLOOKUP($B20,'様式1 名簿'!$A:$C,2,FALSE)&\"　\"&VLOOKUP($B20,'様式1 名簿'!$A:$C,3,FALSE),\"\")","v":""},null,null,{"$f":"IF(ISTEXT(VLOOKUP($B20,'様式1 名簿'!$A:$C,2,FALSE)),VLOOKUP($B20,'様式1 名簿'!$A:$C,2,FALSE)&\"　\"&VLOOKUP($B20,'様式1 名簿'!$A:$C,3,FALSE),\"\")","v":""}]
{"$rows_left_out":30}
{"sheet":"様式6 WC","index":6,"n_rows":49,"n_cols":9,"rows_kept":49,"cut":false,"hidden":true,"merged":[[37,1,37,4],[44,1,44,4],[23,1,23,4],[23,5,23,6],[30,1,30,4],[30,5,30,8],[11,1,11,4],[2,0,2,8],[4,0,4,1],[4,2,4,6],[6,0,6,1],[6,2,6,6]]}
["（様式６号）"]
[]
[{"$f":"注意事項!A1&\"　参加申込書\"","v":"平成２９年度　関東高等学校カヌー大会　参加申込書"}]
[]
["種目",null,"カヌースプリント　女子カナディアン"]
[]
["学校名",null,{"$f":"'様式1 名簿'!$B$8&\"高等学校\"","v":"高等学校"}]
[]
["※黄色いセルに，様式１号のNo.を入力してください。"]
[]
["ＷＣ－１"]
[null,"No.",null,null,null,"氏　名"]
["①",null,{"$f":"IF(ISTEXT(VLOOKUP($B13,'様式1 名簿'!$A:$C,2,FALSE)),VLOOKUP($B13,'様式1 名簿'!$A:$C,2,FALSE)&\"　\"&VLOOKUP($B13,'様式1 名簿'!$A:$C,3,FALSE),\"\")","v":""},null,null,{"$f":"IF(ISTEXT(VLOOKUP($B13,'様式1 名簿'!$A:$C,2,FALSE)),VLOOKUP($B13,'様式1 名簿'!$A:$C,2,FALSE)&\"　\"&VLOOKUP($B13,'様式1 名簿'!$A:$C,3,FALSE),\"\")","v":""}]
["②",null,{"$f":"IF(ISTEXT(VLOOKUP($B14,'様式1 名簿'!$A:$C,2,FALSE)),VLOOKUP($B14,'様式1 名簿'!$A:$C,2,FALSE)&\"　\"&VLOOKUP($B14,'様式1 名簿'!$A:$C,3,FALSE),\"\")","v":""},null,null,{"$f":"IF(ISTEXT(VLOOKUP($B14,'様式1 名簿'!$A:$C,2,FALSE)),VLOOKUP($B14,'様式1 名簿'!$A:$C,2,FALSE)&\"　\"&VLOOKUP($B14,'様式1 名簿'!$A:$C,3,FALSE),\"\")","v":""}]
["③",null,{"$f":"IF(ISTEXT(VLOOKUP($B15,'様式1 名簿'!$A:$C,2,FALSE)),VLOOKUP($B15,'様式1 名簿'!$A:$C,2,FALSE)&\"　\"&VLOOKUP($B15,'様式1 名簿'!$A:$C,3,FALSE),\"\")","v":""},null,null,{"$f":"IF(ISTEXT(VLOOKUP($B15,'様式1 名簿'!$A:$C,2,FALSE)),VLOOKUP($B15,'様式1 名簿'!$A:$C,2,FALSE)&\"　\"&VLOOKUP($B15,'様式1 名簿'!$A:$C,3,FALSE),\"\")","v":""}]
["④",null,{"$f":"IF(ISTEXT(VLOOKUP($B16,'様式1 名簿'!$A:$C,2,FALSE)),VLOOKUP($B16,'様式1 名簿'!$A:$C,2,FALSE)&\"　\"&VLOOKUP($B16,'様式1 名簿'!$A:$C,3,FALSE),\"\")","v":""},null,null,{"$f":"IF(ISTEXT(VLOOKUP($B16,'様式1 名簿'!$A:$C,2,FALSE)),VLOOKUP($B16,'様式1 名簿'!$A:$C,2,FALSE)&\"　\"&VLOOKUP($B16,'様式1 名簿'!$A:$C,3,FALSE),\"\")","v":""}]
["⑤",null,{"$f":"IF(ISTEXT(VLOOKUP($B17,'様式1 名簿'!$A:$C,2,FALSE)),VLOOKUP($B17,'様式1 名簿'!$A:$C,2,FALSE)&\"　\"&VLOOKUP($B17,'様式1 名簿'!$A:$C,3,FALSE),\"\")","v":""},null,null,{"$f":"IF(ISTEXT(VLOOKUP($B17,'様式1 名簿'!$A:$C,2,FALSE)),VLOOKUP($B17,'様式1 名簿'!$A:$C,2,FALSE)&\"　\"&VLOOKUP($B17,'様式1 名簿'!$A:$C,3,FALSE),\"\")","v":""}]
["⑥",null,{"$f":"IF(ISTEXT(VLOOKUP($B18,'様式1 名簿'!$A:$C,2,FALSE)),VLOOKUP($B18,'様式1 名簿'!$A:$C,2,FALSE)&\"　\"&VLOOKUP($B18,'様式1 名簿'!$A:$C,3,FALSE),\"\")","v":""},null,null,{"$f":"IF(ISTEXT(VLOOKUP($B18,'様式1 名簿'!$A:$C,2,FALSE)),VLOOKUP($B18,'様式1 名簿'!$A:$C,2,FALSE)&\"　\"&VLOOKUP($B18,'様式1 名簿'!$A:$C,3,FALSE),\"\")","v":""}]
["⑦",null,{"$f":"IF(ISTEXT(VLOOKUP($B19,'様式1 名簿'!$A:$C,2,FALSE)),VLOOKUP($B19,'様式1 名簿'!$A:$C,2,FALSE)&\"　\"&VLOOKUP($B19,'様式1 名簿'!$A:$C,3,FALSE),\"\")","v":""},null,null,{"$f":"IF(ISTEXT(VLOOKUP($B19,'様式1 名簿'!$A:$C,2,FALSE)),VLOOKUP($B19,'様式1 名簿'!$A:$C,2,FALSE)&\"　\"&VLOOKUP($B19,'様式1 名簿'!$A:$C,3,FALSE),\"\")","v":""}]
["⑧",null,{"$f":"IF(ISTEXT(VLOOKUP($B20,'様式1 名簿'!$A:$C,2,FALSE)),VLOOKUP($B20,'様式1 名簿'!$A:$C,2,FALSE)&\"　\"&VLOOKUP($B20,'様式1 名簿'!$A:$C,3,FALSE),\"\")","v":""},null,null,{"$f":"IF(ISTEXT(VLOOKUP($B20,'様式1 名簿'!$A:$C,2,FALSE)),VLOOKUP($B20,'様式1 名簿'!$A:$C,2,FALSE)&\"　\"&VLOOKUP($B20,'様式1 名簿'!$A:$C,3,FALSE),\"\")","v":""}]
{"$rows_left_out":30}
{"sheet":"様式7 S・P","index":7,"n_rows":36,"n_cols":9,"rows_kept":36,"cut":false,"hidden":false,"merged":[[2,0,2,10],[10,2,10,4],[10,6,10,8],[26,2,26,4],[26,6,26,8],[4,0,4,1],[4,2,4,6],[6,0,6,1],[6,2,6,6]]}
["（様式７号）"]
[]
[{"$f":"注意事項!A1&\"　参加申込書\"","v":"平成２９年度　関東高等学校カヌー大会　参加申込書"}]
[]
["種目",null,"カヌースラローム　カヌーポロ"]
[]
["学校名",null,{"$f":"'様式1 名簿'!$B$8&\"高等学校\"","v":"高等学校"}]
[]
["※黄色いセルに，様式１号のNo.を入力してください。"]
[]
[null,null,"カヌースラローム男子",null,null,null,"カヌースラローム女子"]
[null,null,null,"No.","氏　名",null,null,"No.","氏　名"]
[null,null,"①",null,{"$f":"IF(ISTEXT(VLOOKUP($D13,'様式1 名簿'!$A:$C,2,FALSE)),VLOOKUP($D13,'様式1 名簿'!$A:$C,2,FALSE)&\"　\"&VLOOKUP($D13,'様式1 名簿'!$A:$C,3,FALSE),\"\")","v":""},null,"①",null,{"$f":"IF(ISTEXT(VLOOKUP($H13,'様式1 名簿'!$A:$C,2,FALSE)),VLOOKUP($H13,'様式1 名簿'!$A:$C,2,FALSE)&\"　\"&VLOOKUP($H13,'様式1 名簿'!$A:$C,3,FALSE),\"\")","v":""}]
[null,null,"②",null,{"$f":"IF(ISTEXT(VLOOKUP($D14,'様式1 名簿'!$A:$C,2,FALSE)),VLOOKUP($D14,'様式1 名簿'!$A:$C,2,FALSE)&\"　\"&VLOOKUP($D14,'様式1 名簿'!$A:$C,3,FALSE),\"\")","v":""},null,"②",null,{"$f":"IF(ISTEXT(VLOOKUP($H14,'様式1 名簿'!$A:$C,2,FALSE)),VLOOKUP($H14,'様式1 名簿'!$A:$C,2,FALSE)&\"　\"&VLOOKUP($H14,'様式1 名簿'!$A:$C,3,FALSE),\"\")","v":""}]
[null,null,"③",null,{"$f":"IF(ISTEXT(VLOOKUP($D15,'様式1 名簿'!$A:$C,2,FALSE)),VLOOKUP($D15,'様式1 名簿'!$A:$C,2,FALSE)&\"　\"&VLOOKUP($D15,'様式1 名簿'!$A:$C,3,FALSE),\"\")","v":""},null,"③",null,{"$f":"IF(ISTEXT(VLOOKUP($H15,'様式1 名簿'!$A:$C,2,FALSE)),VLOOKUP($H15,'様式1 名簿'!$A:$C,2,FALSE)&\"　\"&VLOOKUP($H15,'様式1 名簿'!$A:$C,3,FALSE),\"\")","v":""}]
[null,null,"④",null,{"$f":"IF(ISTEXT(VLOOKUP($D16,'様式1 名簿'!$A:$C,2,FALSE)),VLOOKUP($D16,'様式1 名簿'!$A:$C,2,FALSE)&\"　\"&VLOOKUP($D16,'様式1 名簿'!$A:$C,3,FALSE),\"\")","v":""},null,"④",null,{"$f":"IF(ISTEXT(VLOOKUP($H16,'様式1 名簿'!$A:$C,2,FALSE)),VLOOKUP($H16,'様式1 名簿'!$A:$C,2,FALSE)&\"　\"&VLOOKUP($H16,'様式1 名簿'!$A:$C,3,FALSE),\"\")","v":""}]
[null,null,"⑤",null,{"$f":"IF(ISTEXT(VLOOKUP($D17,'様式1 名簿'!$A:$C,2,FALSE)),VLOOKUP($D17,'様式1 名簿'!$A:$C,2,FALSE)&\"　\"&VLOOKUP($D17,'様式1 名簿'!$A:$C,3,FALSE),\"\")","v":""},null,"⑤",null,{"$f":"IF(ISTEXT(VLOOKUP($H17,'様式1 名簿'!$A:$C,2,FALSE)),VLOOKUP($H17,'様式1 名簿'!$A:$C,2,FALSE)&\"　\"&VLOOKUP($H17,'様式1 名簿'!$A:$C,3,FALSE),\"\")","v":""}]
[null,null,"⑥",null,{"$f":"IF(ISTEXT(VLOOKUP($D18,'様式1 名簿'!$A:$C,2,FALSE)),VLOOKUP($D18,'様式1 名簿'!$A:$C,2,FALSE)&\"　\"&VLOOKUP($D18,'様式1 名簿'!$A:$C,3,FALSE),\"\")","v":""},null,"⑥",null,{"$f":"IF(ISTEXT(VLOOKUP($H18,'様式1 名簿'!$A:$C,2,FALSE)),VLOOKUP($H18,'様式1 名簿'!$A:$C,2,FALSE)&\"　\"&VLOOKUP($H18,'様式1 名簿'!$A:$C,3,FALSE),\"\")","v":""}]
[null,null,"⑦",null,{"$f":"IF(ISTEXT(VLOOKUP($D19,'様式1 名簿'!$A:$C,2,FALSE)),VLOOKUP($D19,'様式1 名簿'!$A:$C,2,FALSE)&\"　\"&VLOOKUP($D19,'様式1 名簿'!$A:$C,3,FALSE),\"\")","v":""},null,"⑦",null,{"$f":"IF(ISTEXT(VLOOKUP($H19,'様式1 名簿'!$A:$C,2,FALSE)),VLOOKUP($H19,'様式1 名簿'!$A:$C,2,FALSE)&\"　\"&VLOOKUP($H19,'様式1 名簿'!$A:$C,3,FALSE),\"\")","v":""}]
[null,null,"⑧",null,{"$f":"IF(ISTEXT(VLOOKUP($D20,'様式1 名簿'!$A:$C,2,FALSE)),VLOOKUP($D20,'様式1 名簿'!$A:$C,2,FALSE)&\"　\"&VLOOKUP($D20,'様式1 名簿'!$A:$C,3,FALSE),\"\")","v":""},null,"⑧",null,{"$f":"IF(ISTEXT(VLOOKUP($H20,'様式1 名簿'!$A:$C,2,FALSE)),VLOOKUP($H20,'様式1 名簿'!$A:$C,2,FALSE)&\"　\"&VLOOKUP($H20,'様式1 名簿'!$A:$C,3,FALSE),\"\")","v":""}]
{"$rows_left_out":17}
{"sheet":"様式8 借艇・プログラム","index":8,"n_rows":22,"n_cols":14,"rows_kept":22,"cut":false,"hidden":false,"merged":[[13,9,13,12],[7,7,7,8],[9,11,9,12],[11,9,11,10],[11,11,11,12],[6,9,6,12],[11,3,11,4],[11,7,11,8],[11,1,11,2],[7,9,7,10],[7,11,7,12],[9,9,9,10],[9,5,9,6],[7,1,7,2],[7,3,7,4],[9,1,9,2],[9,3,9,4],[11,5,11,6],[9,7,9,8],[6,0,12,0],[4,8,4,13],[1,0,1,13],[21,0,21,13],[19,5,19,7],[15,0,15,13],[19,3,19,4],[18,2,18,5],[17,2,17,5],[19,8,19,11],[19,0,19,2],[4,5,4,7],[6,1,6,4],[6,5,6,8],[7,5,7,6],[2,0,2,13]]}
["（様式８号）"]
[{"$f":"注意事項!A1","v":"平成２９年度　関東高等学校カヌー大会"}]
["借艇希望調査書・プログラム購入希望調査書"]
[]
[null,null,null,null,null,"学校名",null,null,{"$f":"'様式1 名簿'!$B$8&\"高等学校\"","v":"高等学校"}]
[]
["借　艇","前日",null,null,null,"競技1日目",null,null,null,"競技2日目",null,null,null,"借艇料合計"]
[null,"Ｋ－１",null,"Ｃ－１",null,"Ｋ－１",null,"Ｃ－１",null,"Ｋ－１",null,"Ｃ－１",null,"シングル"]
[null,0,"艇",0,"艇",0,"艇",0,"艇",0,"艇",0,"艇",{"$f":"((B9+D9)*1000)+((F9+H9+J9+L9)*2000)","v":0}]
[null,"Ｋ－２",null,"Ｃ－２",null,"Ｋ－２",null,"Ｃ－２",null,"Ｋ－２",null,"Ｃ－２",null,"ペア"]
[null,0,"艇",0,"艇",0,"艇",0,"艇",0,"艇",0,"艇",{"$f":"((B11+D11)*2000)+((F11+H11+J11+L11)*4000)","v":0}]
[null,"Ｋ－４",null,"Ｃ－４",null,"Ｋ－４",null,"Ｃ－４",null,"Ｋ－４",null,"Ｃ－４",null,"フォア"]
[null,0,"艇",0,"艇",0,"艇",0,"艇",0,"艇",0,"艇",{"$f":"((B13+D13)*4000)+((F13+H13+J13+L13)*8000)","v":0}]
[null,null,null,null,null,null,null,null,null,"合計",null,null,null,{"$f":"N9+N11+N13","v":0}]
[]
["借艇希望調査について\n　上記、調査書の該当欄に借艇希望艇数を入れてください。\n◇借艇料\n　【競技前日】\n　　シングル：1,000円　ペア2,000円　フォア4,000円\n　【競技当日（1日当たり）】\n　　シングル：2,000円　ペア4,000円　フォア8,000円"]
[]
[null,null,"購入部数入力"]
[null,null,"↓"]
["プログラム",null,null,0,null,"部×500円＝",null,null,{"$f":"D20*500","v":0}]
{"$rows_left_out":2}